{"text_format":"3","workbook":"xlsx","n_sheets":10,"sheets":["Intro","Information","Map","Battle","Quest Log","Quest Details","Character Stats","Character Data","BattleProbabilities","Level Exp Tracker"],"not_rendered":{"images":17,"macros":1},"read":"whole","date_system":"1900"}

{"sheet":"Intro","index":0,"n_rows":22,"n_cols":19,"rows_kept":22,"merged":[[2,3,2,10],[3,3,3,10],[5,3,13,10],[20,9,20,10],[21,9,21,10]]}
[]
[]
[{"$nulls":3},"Welcome to FloorBowl"]
[{"$nulls":3},"A turn based Skyrim inspired RPG."]
[]
[{"$nulls":3},"You are the Wyvernspawn - once profesized and long forgotten. Your memory is foggy, your head is heavy - you have no memory of your journey or what foul deeds led you here.\n\nYou try to look around but find you are gagged, tied and bound. All you know is you must escape this prison!\n\nBe it fate, luck or the will of the gods - but outside sparks sudden action. There is no need for planning, as chaos has broken on all sides. The horns of war have been blown. Perchance escape has drawn its card for you.\n\nGuards rush blindly into your cell, removing your bounds and releasing all within the cells. The fear in their eyes sends chills down your spine.\n\nYou, and your fellow prisoners bolt for the door, moving just in time as the roof of your cell collapses, crushing all that still remain within it.\n\nThe dealer of the damage is shown to you. A foul lizard like abomination is above you. Tales of old flash into your mind - ahead of you is a Wyvern, a dragon beast, long thought of vanquishsed from a time now forgotten.\n\nAdrenaline spurs your legs onwards as you flea from this place. Without realising it another travels with you - a prisoner of similar fate - now companion on your journey. This campanion you urges you on your journey, to SteamTree and reporting of the Wyvern's sudden return!"]
{"$rows_left_out":10}
{"sheet":"Information","index":1,"n_rows":54,"n_cols":2,"rows_kept":54,"hidden":true,"merged":[[3,1,3,11],[4,1,4,11],[11,1,11,11],[23,1,24,11],[26,1,27,11],[30,1,32,11],[38,1,39,11],[43,1,44,11],[53,1,54,11]]}
[]
[]
[]
[null,"Welcome to the world of FloorBowl!"]
[null,"FloorBowl is the home of a Skyrim inspired adventure game"]
[]
{"$rows_left_out":49}
{"sheet":"Map","index":2,"n_rows":86,"n_cols":159,"rows_kept":86,"hidden":true,"merged":[[0,1,0,10],[0,11,0,20],[0,21,0,30],[0,31,0,40],[0,41,0,50],[0,51,0,60],[0,61,0,70],[0,71,0,80],[0,81,0,90],[0,91,0,100],[0,101,0,110],[0,111,0,120],[1,0,10,0],[6,123,7,127],[8,124,9,124],[8,126,9,126],[10,123,11,123],[10,124,11,124],[10,126,11,126],[11,0,20,0],[12,123,13,123],[12,124,13,124],[12,126,13,126],[14,123,15,123],[14,124,15,124],[14,126,15,126],[16,123,17,123],[16,124,17,124],[16,126,17,126],[18,123,19,123],[18,124,19,124],[18,126,19,126],[20,123,21,123],[20,124,21,124],[20,126,21,126],[21,0,30,0],[22,123,23,123],[22,124,28,125],[22,126,28,127],[31,0,40,0],[31,123,32,125],[31,126,32,127],[33,126,34,127],[35,126,36,127],[37,126,38,127],[41,0,50,0],[45,123,46,127],[47,123,48,123],[47,124,48,124],[47,125,48,126],[47,127,48,127],[49,123,50,123],[49,124,50,124],[49,125,50,126],[49,127,50,127],[49,129,50,129],[51,0,60,0],[51,123,52,123],[51,124,52,124],[51,125,52,126],[51,127,52,127],[55,123,56,127],[57,123,58,125],[59,123,60,123],[59,124,60,124],[59,125,60,125],[61,0,70,0],[62,123,63,124],[62,125,63,126],[64,123,65,123],[64,125,65,125],[68,123,69,127],[70,123,71,124],[70,125,71,126],[71,0,80,0],[72,123,73,124],[72,125,73,126]]}
[null,"A",{"$nulls":9},"B",{"$nulls":9},"C",{"$nulls":9},"D",{"$nulls":9},"E",{"$nulls":9},"F",{"$nulls":9},"G",{"$nulls":9},"H",{"$nulls":9},"I",{"$nulls":9},"J",{"$nulls":9},"K",{"$nulls":9},"L"]
[1,{"$nulls":133},"Message",1,2,3,4,5,6,7,8,9,10,11,12,13,14,15,16,17,18,19,null,"Key Info for questing"]
[{"$nulls":134},"Hanger","Time to rest and heal your weary soul.","Time to rest and heal your weary soul.","Time to rest and heal your weary soul.","Time to rest and heal your weary soul.","Time to rest and heal your weary soul.","Time to rest and heal your weary soul.","Time to rest and heal your weary soul.","Time to rest and heal your weary soul.","Time to rest and heal your weary soul.",{"$f":"'Quest Details'!G12","v":"Things are worse than we feared. Wyvern are not just coming back to life - but they are resurrecting other Wyverns! It seems somehow the Dark Elves are helping them. Daphne is out of ideas, but suggests seeking out an old friend, Eric, could help. Daphne thinks Eric may be Crackton."},"Time to rest and heal your weary soul.","Time to rest and heal your weary soul.","Time to rest and heal your weary soul.","Time to rest and heal your weary soul.","Time to rest and heal your weary soul.","Time to rest and heal your weary soul.","Time to rest and heal your weary soul.","Time to rest and heal your weary soul.","Time to rest and heal your weary soul."]
[{"$nulls":134},"Lonlihood","Time to rest and heal your weary soul.","Time to rest and heal your weary soul.","Time to rest and heal your weary soul.","Time to rest and heal your weary soul.","Time to rest and heal your weary soul.","Time to rest and heal your weary soul.","Time to rest and heal your weary soul.","Time to rest and heal your weary soul.","Time to rest and heal your weary soul.","Time to rest and heal your weary soul.","Time to rest and heal your weary soul.","Time to rest and heal your weary soul.","Time to rest and heal your weary soul.","Time to rest and heal your weary soul.","Time to rest and heal your weary soul.","Time to rest and heal your weary soul.","Time to rest and heal your weary soul.","Time to rest and heal your weary soul.","Time to rest and heal your weary soul.",null,"Town Locations","Town Name","Pop up message","Game State Progression"]
[{"$nulls":134},"Spottart","Time to rest and heal your weary soul.","Time to rest and heal your weary soul.","Time to rest and heal your weary soul.","Time to rest and heal your weary soul.","Time to rest and heal your weary soul.","Time to rest and heal your weary soul.","Time to rest and heal your weary soul.","Time to rest and heal your weary soul.","Time to rest and heal your weary soul.","Time to rest and heal your weary soul.","Time to rest and heal your weary soul.","Time to rest and heal your weary soul.","Time to rest and heal your weary soul.","Time to rest and heal your weary soul.","Time to rest and heal your weary soul.","Time to rest and heal your weary soul.","Time to rest and heal your weary soul.","Time to rest and heal your weary soul.","Time to rest and heal your weary soul.",null,"$AE$11",{"$f":"EE3","v":"Hanger"},{"$f":"VLOOKUP(FA5,$EE$3:$EX$21,$DT$65+1,FALSE)","v":"Time to rest and heal your weary soul."},{"$f":"VLOOKUP(FA5,$EE$37:$EX$55,$DT$65+1,FALSE)","v":1}]
[{"$nulls":134},"Safe Haven","Time to rest and heal your weary soul.","Time to rest and heal your weary soul.","Time to rest and heal your weary soul.","Time to rest and heal your weary soul.","Time to rest and heal your weary soul.","Time to rest and heal your weary soul.","Time to rest and heal your weary soul.","Time to rest and heal your weary soul.","Time to rest and heal your weary soul.","Time to rest and heal your weary soul.","Time to rest and heal your weary soul.",{"$f":"'Quest Details'!G14","v":"Safe Haven revealed the secrets of defeating the Wyvern King. Words of Power are the key! Lets return to the Whitechins to seek their training and wisdom."},"Time to rest and heal your weary soul.","Time to rest and heal your weary soul.","Time to rest and heal your weary soul.","Time to rest and heal your weary soul.","Time to rest and heal your weary soul.","Time to rest and heal your weary soul.","Time to rest and heal your weary soul.",null,"$AK$15",{"$f":"EE4","v":"Lonlihood"},"Time to rest and heal your weary soul.",1]
{"$rows_left_out":74}
{"sheet":"Battle","index":3,"n_rows":94,"n_cols":35,"rows_kept":94,"hidden":true,"merged":[[3,7,3,9],[4,7,4,9],[5,7,5,9],[6,7,6,9],[7,7,7,9],[31,0,31,7],[51,0,51,7],[72,1,72,3],[73,1,73,3],[74,1,74,3],[75,1,75,3],[76,1,76,3]]}
[{"$nulls":10},"Planned","Type of Battle",{"$f":"K1","v":"Planned"},{"$f":"VLOOKUP(M1,'Character Data'!X25:Y27,2,FALSE)","v":25}]
["Enemies",1,2,3,4,5,null,null,{"$f":"MAX(E13:E19)","v":0},null,"Small Group of Orcs","Enemies",{"$f":"K2","v":"Small Group of Orcs"},{"$nulls":8},"Warrior","Mage","Archer",{"$f":"'Character Data'!Y5","v":"Bandit Warrior"},{"$f":"'Character Data'!Z5","v":"Bandit Archer"},{"$f":"'Character Data'!AA5","v":"Skeleton Warrior"},{"$f":"'Character Data'!AB5","v":"Wyvern"},{"$f":"'Character Data'!AC5","v":"Ghost"},{"$f":"'Character Data'!AD5","v":"Giant Rat"},{"$f":"'Character Data'!AE5","v":"Orc Warrior"},{"$f":"'Character Data'!AF5","v":"Orc Thrower"},{"$f":"'Character Data'!AG5","v":"Bear"},{"$f":"'Character Data'!AH5","v":"Dark Elf Warrior"},{"$f":"'Character Data'!AI5","v":"Dark Elf Archer"}]
["Name",{"$f":"IF(L5=0,\"\",L5)","v":"Orc Warrior"},{"$f":"IF(M5=0,\"\",M5)","v":"Orc Thrower"},{"$f":"IF(N5=0,\"\",N5)","v":""},{"$f":"IF(O5=0,\"\",O5)","v":""},{"$f":"IF(P5=0,\"\",P5)","v":""},{"$nulls":14},"Level",{"$f":"Map!DU19","v":1},{"$f":"$V$3","v":1},{"$f":"$W$3","v":1},{"$f":"V3","v":1},{"$f":"W3","v":1},1,1,1,1,1,1,1,1,1]
["Image",{"$f":"IFERROR(IF(B5=0,$U$22,HLOOKUP(B$3,$Y$2:$AI$22,21,FALSE)),\"\")","v":{"$error":"#VALUE!"}},{"$f":"IFERROR(IF(C5=0,$U$22,HLOOKUP(C$3,$Y$2:$AI$22,21,FALSE)),\"\")","v":{"$error":"#VALUE!"}},{"$f":"IFERROR(IF(D5=0,$U$22,HLOOKUP(D$3,$Y$2:$AI$22,21,FALSE)),\"\")","v":{"$error":"#VALUE!"}},{"$f":"IFERROR(IF(E5=0,$U$22,HLOOKUP(E$3,$Y$2:$AI$22,21,FALSE)),\"\")","v":{"$error":"#VALUE!"}},{"$f":"IFERROR(IF(F5=0,$U$22,HLOOKUP(F$3,$Y$2:$AI$22,21,FALSE)),\"\")","v":{"$error":"#VALUE!"}},{"$nulls":5},1,2,3,4,5,{"$nulls":4},"HP",{"$f":"HLOOKUP($V$3,'Character Data'!$C$5:$V$21,2,FALSE)","v":17},{"$f":"HLOOKUP($W$3,'Character Data'!$C$25:$V$41,2,FALSE)","v":13},{"$f":"HLOOKUP($X$3,'Character Data'!$C$45:$V$61,2,FALSE)","v":15},{"$f":"'Character Data'!Y6+((Y3-1)*4)","v":7},{"$f":"'Character Data'!Z6+((Z3-1)*4)","v":7},{"$f":"'Character Data'!AA6+((AA3-1)*3)","v":13},{"$f":"'Character Data'!AB6+((AB3-5)*10)","v":40},{"$f":"'Character Data'!AC6+((AC3-5)*3)","v":33},{"$f":"'Character Data'!AD6+((AD3-1)*4)","v":7},{"$f":"'Character Data'!AE6+((AE3-1)*5)","v":15},{"$f":"'Character Data'!AF6+((AF3-1)*5)","v":15},{"$f":"'Character Data'!AG6+((AG3-2)*6)","v":28},{"$f":"'Character Data'!AH6+((AH3-1)*4)","v":11},{"$f":"'Character Data'!AI6+((AI3-1)*4)","v":13}]
["Health",15,15,0,0,0,{"$nulls":5},{"$f":"VLOOKUP(Battle!$M$2,'Character Data'!$AL$13:$AQ$24,2,FALSE)","v":"Orc Warrior"},{"$f":"VLOOKUP(Battle!$M$2,'Character Data'!$AL$13:$AQ$24,3,FALSE)","v":"Orc Thrower"},{"$f":"IF(V3=1,\"\",VLOOKUP(Battle!$M$2,'Character Data'!$AL$13:$AQ$24,4,FALSE))","v":""},{"$f":"IF(V3<3,\"\",VLOOKUP(Battle!$M$2,'Character Data'!$AL$13:$AQ$24,5,FALSE))","v":""},{"$f":"IF(V3<4,\"\",VLOOKUP(Battle!$M$2,'Character Data'!$AL$13:$AQ$24,6,FALSE))","v":""},{"$nulls":4},"Strength",{"$f":"HLOOKUP($V$3,'Character Data'!$C$5:$V$21,3,FALSE)","v":17},{"$f":"HLOOKUP($W$3,'Character Data'!$C$25:$V$41,3,FALSE)","v":9},{"$f":"HLOOKUP($X$3,'Character Data'!$C$45:$V$61,3,FALSE)","v":12},{"$f":"'Character Data'!Y7","v":8},{"$f":"'Character Data'!Z7","v":8},{"$f":"'Character Data'!AA7","v":10},{"$f":"'Character Data'!AB7","v":20},{"$f":"'Character Data'!AC7","v":7},{"$f":"'Character Data'!AD7","v":7},{"$f":"'Character Data'!AE7","v":16},{"$f":"'Character Data'!AF7","v":16},{"$f":"'Character Data'!AG7","v":19},{"$f":"'Character Data'!AH7","v":11},{"$f":"'Character Data'!AI7","v":10}]
["Weapon",{"$f":"HLOOKUP(B$3,$Y$2:$AI$21,14,FALSE)","v":"Greataxe"},{"$f":"IFERROR(HLOOKUP(C$3,$Y$2:$AI$21,14,FALSE),\"\")","v":"Javelin"},{"$f":"IFERROR(HLOOKUP(D$3,$Y$2:$AI$21,14,FALSE),\"\")","v":""},{"$f":"IFERROR(HLOOKUP(E$3,$Y$2:$AI$21,14,FALSE),\"\")","v":""},{"$f":"IFERROR(HLOOKUP(F$3,$Y$2:$AI$21,14,FALSE),\"\")","v":""},{"$nulls":4},2,2,1,2,2,1,{"$nulls":4},"Dexterity",{"$f":"HLOOKUP($V$3,'Character Data'!$C$5:$V$21,4,FALSE)","v":13},{"$f":"HLOOKUP($W$3,'Character Data'!$C$25:$V$41,4,FALSE)","v":14},{"$f":"HLOOKUP($X$3,'Character Data'!$C$45:$V$61,4,FALSE)","v":17},{"$f":"'Character Data'!Y8","v":14},{"$f":"'Character Data'!Z8","v":14},{"$f":"'Character Data'!AA8","v":14},{"$f":"'Character Data'!AB8","v":10},{"$f":"'Character Data'!AC8","v":13},{"$f":"'Character Data'!AD8","v":15},{"$f":"'Character Data'!AE8","v":12},{"$f":"'Character Data'!AF8","v":12},{"$f":"'Character Data'!AG8","v":10},{"$f":"'Character Data'!AH8","v":12},{"$f":"'Character Data'!AI8","v":14}]
{"$rows_left_out":82}
{"sheet":"Quest Log","index":4,"n_rows":21,"n_cols":8,"rows_kept":21,"hidden":true}
[]
[null,{"$f":"Map!$DT$65","v":1},"Quest Number","Quest Name","Quest Detail","Status"]
[null,null,1,{"$f":"G3","v":"Unleashed"},{"$f":"H3","v":"The Wyvern has returned! You must head to Steamtree and report of the horrors."},{"$f":"IF(B2=1,\"In Progress\",\"Complete\")","v":"In Progress"},{"$f":"Map!EG67","v":"Unleashed"},{"$f":"Map!EJ67","v":"The Wyvern has returned! You must head to Steamtree and report of the horrors."}]
[null,null,2,{"$f":"IF($B$2>1,G4,\"\")","v":""},{"$f":"IF($B$2>1,H4,\"\")","v":""},{"$f":"IF($B$2=2,\"In Progress\",IF($B$2>1,(\"Complete\"),\"\"))","v":""},{"$f":"Map!EG68","v":"Storm's Brewing"},{"$f":"Map!EJ68","v":"You made it safely to SteamTree and rest for a while. The local Inn keep is fascinated by your story and suggests the Jarl of Darkwalk would want to hear it."}]
[null,null,3,{"$f":"IF($B$2>2,G5,\"\")","v":""},{"$f":"IF($B$2>2,H5,\"\")","v":""},{"$f":"IF($B$2=3,\"In Progress\",IF($B$2>2,(\"Complete\"),\"\"))","v":""},{"$f":"Map!EG69","v":"WyvernStone"},{"$f":"Map!EJ69","v":"The Jarl wants you to explore an ancient ruin known as the 'Greyfalls'. Rumour has it there is an ancient stone buried within that may hold secrets of why the Wyvern are returning."}]
[null,null,4,{"$f":"IF($B$2>3,G6,\"\")","v":""},{"$f":"IF($B$2>3,H6,\"\")","v":""},{"$f":"IF($B$2=4,\"In Progress\",IF($B$2>3,(\"Complete\"),\"\"))","v":""},{"$f":"Map!EG70","v":"Wyvern rising"},{"$f":"Map!EJ70","v":"You have found a Wyvernstone but cannot read the marks. Best take it back to the Jarl of Darkwalk who should be able to help."}]
{"$rows_left_out":16}
{"sheet":"Quest Details","index":5,"n_rows":21,"n_cols":7,"rows_kept":21,"hidden":true}
[]
[null,null,"Quest Number","Quest Name","Quest Goal Location","Quest Text","Next Text"]
[null,null,1,"Unleashed","Steamtree","Escape Shellgon - you know of the local town of Steamtree. Perhaps you can find refuge there?","You made it safely to SteamTree and rest for a while. The local Inn keep is fascinated by your story and suggests the Jarl of Darkwalk would want to hear it."]
[null,null,2,"Storm's Brewing","Darkwalk","Journey to Darkwalk and report to the Jarl about the Wyvern Attack","The Jarl wants you to explore an ancient ruin known as the 'Greyfalls'. Rumour has it there is an ancient stone buried within that may hold secrets of why the Wyvern are returning."]
[null,null,3,"WyvernStone","Greyfalls","Delve into the ancient ruin to recovery the Wyvernstone","You have found a Wyvernstone but cannot read the marks. Best take it back to the Jarl of Darkwalk who should be able to help."]
[null,null,4,"Wyvern rising","Darkwalk","Take the Wyvernstone to Darkwalk.","A Dragon appears! With the help of the town guard, you manage to best the dragon.\nThis one was but a babe, others, those fully grown will be much harder.\n Meanwhile the mage of Darkwalk has unravelled the mystery of the Wyvernstone. You must travel to the top of the world and meet with the Whitechins."]
{"$rows_left_out":16}
{"sheet":"Character Stats","index":6,"n_rows":25,"n_cols":15,"rows_kept":25,"hidden":true}
[]
[null,"Name",{"$f":"Intro!G17","v":"Pear"},{"$f":"Intro!I17","v":"Dynamic"},{"$nulls":8},"Warrior","Mage","Archer"]
[null,"Image",{"$f":"Map!DU23","v":{"$error":"#VALUE!"}},{"$f":"Map!DW23","v":{"$error":"#VALUE!"}},{"$nulls":7},"Level",{"$f":"Battle!V3","v":1},{"$f":"Battle!W3","v":1},{"$f":"Battle!X3","v":1}]
[null,"Level",{"$f":"Map!DU19","v":1},{"$f":"C4","v":1},{"$nulls":7},"HP",{"$f":"Battle!V4","v":17},{"$f":"Battle!W4","v":13},{"$f":"Battle!X4","v":15}]
[null,"Class",{"$f":"Intro!G18","v":"Warrior"},{"$f":"Intro!I18","v":"Archer"},{"$nulls":7},"Strength",{"$f":"Battle!V5","v":17},{"$f":"Battle!W5","v":9},{"$f":"Battle!X5","v":12}]
[null,"Health Points",{"$f":"HLOOKUP(C$5,$L$2:$O$19,3,FALSE)","v":17},{"$f":"HLOOKUP(D$5,$L$2:$O$19,3,FALSE)","v":15},{"$nulls":7},"Dexterity",{"$f":"Battle!V6","v":13},{"$f":"Battle!W6","v":14},{"$f":"Battle!X6","v":17}]
{"$rows_left_out":20}
{"sheet":"Character Data","index":7,"n_rows":61,"n_cols":43,"rows_kept":61,"hidden":true}
[{"$nulls":23},"Enemy Types",{"$nulls":12},{"$f":"Y5","v":"Bandit Warrior"},null,{"$f":"AA5","v":"Skeleton Warrior"}]
[{"$nulls":36},{"$f":"Z5","v":"Bandit Archer"},null,{"$f":"AB5","v":"Wyvern"}]
[null,"Character",{"$nulls":21},"Character"]
[null,"Warrior"]
[null,"Level",1,2,3,4,5,6,7,8,9,10,11,12,13,14,15,16,17,18,19,20,null,"Level","Bandit Warrior","Bandit Archer","Skeleton Warrior","Wyvern","Ghost","Giant Rat","Orc Warrior","Orc Thrower","Bear","Dark Elf Warrior","Dark Elf Archer",null,{"$f":"AC5","v":"Ghost"},null,{"$f":"AD5","v":"Giant Rat"}]
[null,"HP",17,25,33,41,49,57,65,73,81,89,97,105,113,121,129,137,145,153,180,189,null,"HP",7,7,13,80,45,7,15,15,34,11,13]
{"$rows_left_out":56}
{"sheet":"BattleProbabilities","index":8,"n_rows":13,"n_cols":42,"rows_kept":13,"hidden":true}
["Prob.",1,2,3,4,5,6,7,8,9,10,11,12,13,14,15,16,17,18,19,20,null,1,2,3,4,5,6,7,8,9,10,11,12,13,14,15,16,17,18,19,20]
[{"$f":"'Character Data'!AL13","v":"Small Group of Bandits"},1,1,1,1,1,1,1,1,1,1,1,1,1,1,1,1,1,1,1,1,null,0.04,0.09,0,0,0.19,0.15,0.15,0,{"$f":"1/12","v":0.08333333333333333},0.08333333333333333,0.08333333333333333,0.08333333333333333,0.08333333333333333,0.08333333333333333,0.08333333333333333,0.08333333333333333,0.08333333333333333,0.08333333333333333,0.08333333333333333,0.08333333333333333]
[{"$f":"'Character Data'!AL14","v":"Group of Bandits"},0,1,1,1,1,1,1,1,1,1,1,1,1,1,1,1,1,1,1,1,null,0.04,0.09,0.2,0.1,0.19,0.15,0.15,0,{"$f":"1/12","v":0.08333333333333333},0.08333333333333333,0.08333333333333333,0.08333333333333333,0.08333333333333333,0.08333333333333333,0.08333333333333333,0.08333333333333333,0.08333333333333333,0.08333333333333333,0.08333333333333333,0.08333333333333333]
[{"$f":"'Character Data'!AL15","v":"Large Groub of Bandits"},0,0,0,0,1,1,1,1,1,1,1,1,1,1,1,1,1,1,1,1,null,0.04,0.09,0.37,0.46,0.19,0.15,0.15,0,0.08333333333333333,0.08333333333333333,0.08333333333333333,0.08333333333333333,0.08333333333333333,0.08333333333333333,0.08333333333333333,0.08333333333333333,0.08333333333333333,0.08333333333333333,0.08333333333333333,0.08333333333333333]
[{"$f":"'Character Data'!AL16","v":"Ghost"},0,0,0,0,0,1,1,1,1,1,1,1,1,1,1,1,1,1,1,1,null,0.01,0.01,0.01,0.03,0.05,0.07,0.07,0.12,0.08333333333333333,0.08333333333333333,0.08333333333333333,0.08333333333333333,0.08333333333333333,0.08333333333333333,0.08333333333333333,0.08333333333333333,0.08333333333333333,0.08333333333333333,0.08333333333333333,0.08333333333333333]
[{"$f":"'Character Data'!AL17","v":"Small Group of Orcs"},1,1,1,1,1,1,1,1,1,1,1,1,1,1,1,1,1,1,1,1,null,0.025,0.025,0.025,0.05,0.05,0.07,0.07,0.12,0.08333333333333333,0.08333333333333333,0.08333333333333333,0.08333333333333333,0.08333333333333333,0.08333333333333333,0.08333333333333333,0.08333333333333333,0.08333333333333333,0.08333333333333333,0.08333333333333333,0.08333333333333333]
{"$rows_left_out":8}
{"sheet":"Level Exp Tracker","index":9,"n_rows":5,"n_cols":26,"rows_kept":5,"hidden":true}
[{"$nulls":3},"Sum of Exp"]
[{"$nulls":3},{"$f":"SUM(A:A)","v":0}]
[{"$nulls":5},1,2,3,4,5,6,7,8,9,10,11,12,13,14,15,16,17,18,19,20]
[{"$nulls":5},3,3,5,5,7,7,9,9,11,11,13,13,15,15,17,17,19,19,25,99999999,{"$f":"SUM(F4:Y4)","v":100000222}]
[{"$nulls":5},{"$f":"IF($D$2>F4-0.1,1,0)","v":0},{"$f":"IF($D$2>G4-0.1,1,0)","v":0},0,0,0,0,0,0,{"$f":"IF($D$2>N4-0.1,1,0)","v":0},{"$f":"IF($D$2>O4-0.1,1,0)","v":0},0,0,0,0,0,0,0,0,0,0]